BDBM184371 US9150578, I-019
SMILES Cc1cc(Nc2ncc3CCc4nn(C)c(Cc5cccc(c5)-c5cnn(C)c5)c4-c3n2)nn1C
InChI Key InChIKey=CZHQIACJGGUSQU-UHFFFAOYSA-N
Data  1 IC50
  Tab Delimited (TSV)   2D SDfile   Computed 3D by Vconf -m prep SDfile
Find this compound or compounds like it in BindingDB:
Activity Spreadsheet -- Enzyme Inhibition Constant Data from BindingDB
Found 1 hit for monomerid = 184371
TargetInsulin receptor [964-1370](Homo sapiens (Human))
Boehringer Ingelheim International
US Patent
LigandPNGBDBM184371(US9150578, I-019)
Affinity DataIC50:  0.870nMpH: 7.4Assay Description:The kinase activity is measured by DELFIA.RTM. assay (dissociation-enhanced lanthanide fluorescence immunoassay, Perkin Elmer). The cytoplasmic kinas...
In DepthDetails US Patent