BDBM184389 US9150578, I-037
SMILES Cn1cc(cn1)-c1cccc(Cc2c-3c(CCc4cnc(Nc5ccn(CCCn6ccnc6)n5)nc-34)nn2C)c1
InChI Key InChIKey=LNCMGLWONSBOCY-UHFFFAOYSA-N
Data  1 IC50
  Tab Delimited (TSV)   2D SDfile   Computed 3D by Vconf -m prep SDfile
Find this compound or compounds like it in BindingDB:
Activity Spreadsheet -- Enzyme Inhibition Constant Data from BindingDB
Found 1 hit for monomerid = 184389
TargetInsulin receptor [964-1370](Homo sapiens (Human))
Boehringer Ingelheim International
US Patent
LigandPNGBDBM184389(US9150578, I-037)
Affinity DataIC50:  0.230nMpH: 7.4Assay Description:The kinase activity is measured by DELFIA.RTM. assay (dissociation-enhanced lanthanide fluorescence immunoassay, Perkin Elmer). The cytoplasmic kinas...
In DepthDetails US Patent