BDBM184489 US9150578, I-191
SMILES COCCn1ccc(Nc2ncc3CCc4nn(C)c(c4-c3n2)-c2ccc(cc2)-c2cnn(CCN3CCC(CC3)C#N)c2)n1
InChI Key InChIKey=RXAVSKHCIFNSSC-UHFFFAOYSA-N
Data  1 IC50
  Tab Delimited (TSV)   2D SDfile   Computed 3D by Vconf -m prep SDfile
Find this compound or compounds like it in BindingDB:
Activity Spreadsheet -- Enzyme Inhibition Constant Data from BindingDB
Found 1 hit for monomerid = 184489
TargetInsulin receptor [964-1370](Homo sapiens (Human))
Boehringer Ingelheim International
US Patent
LigandPNGBDBM184489(US9150578, I-191)
Affinity DataIC50:  0.260nMpH: 7.4Assay Description:The kinase activity is measured by DELFIA.RTM. assay (dissociation-enhanced lanthanide fluorescence immunoassay, Perkin Elmer). The cytoplasmic kinas...
In DepthDetails US Patent