BDBM184666 US9156811, DDD71250
SMILES Cc1nn(C)c(C)c1N[SH+](=O)c1cccc(c1)C#N
InChI Key InChIKey=YLPXRHXCEPLYGW-UHFFFAOYSA-O
Data  1 IC50
  Tab Delimited (TSV)   2D SDfile   Computed 3D by Vconf -m prep SDfile
Find this compound or compounds like it in BindingDB:
Activity Spreadsheet -- Enzyme Inhibition Constant Data from BindingDB
Found 1 hit for monomerid = 184666
TargetGlycylpeptide N-tetradecanoyltransferase(Trypanosoma brucei)
Univeristy Of Dundee
US Patent
LigandPNGBDBM184666(US9156811, DDD71250)
Affinity DataIC50:  2.81E+4nMpH: 7.4 T: 2°C. Assay description: Measurement of the ability of compounds to inhibit the NMT-1 and/or NMT-2 enzyme isoforms of human, trypanosome (T. brucei), leishmanial (L. major) a...
Ligand InfoPC cidPC sid
In DepthDetails US Patent