BDBM184671 US9156811, DDD71275
SMILES COc1ccc(OCCC[S+]([O-])(=O)Nc2c(C)nn(C)c2C)cc1
InChI Key InChIKey=DUERUFOOUCHDIG-UHFFFAOYSA-N
Data  1 IC50
  Tab Delimited (TSV)   2D SDfile   Computed 3D by Vconf -m prep SDfile
Find this compound or compounds like it in BindingDB:
Activity Spreadsheet -- Enzyme Inhibition Constant Data from BindingDB
Found 1 hit for monomerid = 184671
TargetGlycylpeptide N-tetradecanoyltransferase(Trypanosoma brucei)
Univeristy Of Dundee
US Patent
LigandPNGBDBM184671(US9156811, DDD71275)
Affinity DataIC50:  6.20E+4nMpH: 7.4 T: 2°C. Assay description: Measurement of the ability of compounds to inhibit the NMT-1 and/or NMT-2 enzyme isoforms of human, trypanosome (T. brucei), leishmanial (L. major) a...
Ligand InfoPC cidPC sid
In DepthDetails US Patent