BDBM184690 US9156811, DDD71295
SMILES COc1cc(C)c(c(C)c1C)[S+]([O-])(=O)Nc1ccncn1
InChI Key InChIKey=WAJCENRZCJQJGQ-UHFFFAOYSA-N
Data  1 IC50
  Tab Delimited (TSV)   2D SDfile   Computed 3D by Vconf -m prep SDfile
Find this compound or compounds like it in BindingDB:
Activity Spreadsheet -- Enzyme Inhibition Constant Data from BindingDB
Found 1 hit for monomerid = 184690
TargetGlycylpeptide N-tetradecanoyltransferase(Trypanosoma brucei)
Univeristy Of Dundee
US Patent
LigandPNGBDBM184690(US9156811, DDD71295)
Affinity DataIC50:  3.00E+4nMpH: 7.4 T: 2°C. Assay description: Measurement of the ability of compounds to inhibit the NMT-1 and/or NMT-2 enzyme isoforms of human, trypanosome (T. brucei), leishmanial (L. major) a...
Ligand InfoPC cidPC sid
In DepthDetails US Patent