BDBM184906 US9156811, DDD87753
SMILES CN1CCN(CCc2cccc(c2)-c2ccc(cc2)[S+]([O-])(=O)Nc2c(C)nn(C)c2C)CC1
InChI Key InChIKey=NJJQYISAKGZXAK-UHFFFAOYSA-N
Data  3 IC50
  Tab Delimited (TSV)   2D SDfile   Computed 3D by Vconf -m prep SDfile
Find this compound or compounds like it in BindingDB:
Activity Spreadsheet -- Enzyme Inhibition Constant Data from BindingDB
Found 3 hits for monomerid = 184906
TargetGlycylpeptide N-tetradecanoyltransferase(Trypanosoma brucei)
Univeristy Of Dundee
US Patent
LigandPNGBDBM184906(US9156811, DDD87753)
Affinity DataIC50:  230nMpH: 7.4 T: 2°C. Assay description: Measurement of the ability of compounds to inhibit the NMT-1 and/or NMT-2 enzyme isoforms of human, trypanosome (T. brucei), leishmanial (L. major) a...
In DepthDetails US Patent
TargetGlycylpeptide N-tetradecanoyltransferase(Aspergillus fumigatus)
Univeristy Of Dundee
US Patent
LigandPNGBDBM184906(US9156811, DDD87753)
Affinity DataIC50:  800nMpH: 7.4 T: 2°C. Assay description: Measurement of the ability of compounds to inhibit the NMT-1 and/or NMT-2 enzyme isoforms of human, trypanosome (T. brucei), leishmanial (L. major) a...
In DepthDetails US Patent
TargetGlycylpeptide N-tetradecanoyltransferase 1(Homo sapiens (Human))
Univeristy Of Dundee
US Patent
LigandPNGBDBM184906(US9156811, DDD87753)
Affinity DataIC50:  180nMpH: 7.4 T: 2°C. Assay description: Measurement of the ability of compounds to inhibit the NMT-1 and/or NMT-2 enzyme isoforms of human, trypanosome (T. brucei), leishmanial (L. major) a...
In DepthDetails US Patent