BDBM185094 US9156811, DDD100800
SMILES CCCNCc1cccc(c1)-c1ccc(cc1)[S+]([O-])(=O)Nc1c(CC(C)C)nn(C)c1C
InChI Key InChIKey=GUUDXDDOCWFTTL-UHFFFAOYSA-N
Data  3 IC50
  Tab Delimited (TSV)   2D SDfile   Computed 3D by Vconf -m prep SDfile
Find this compound or compounds like it in BindingDB:
Activity Spreadsheet -- Enzyme Inhibition Constant Data from BindingDB
Found 3 hits for monomerid = 185094
TargetGlycylpeptide N-tetradecanoyltransferase(Trypanosoma brucei)
Univeristy Of Dundee
US Patent
LigandPNGBDBM185094(US9156811, DDD100800)
Affinity DataIC50:  6nMpH: 7.4 T: 2°C. Assay description: Measurement of the ability of compounds to inhibit the NMT-1 and/or NMT-2 enzyme isoforms of human, trypanosome (T. brucei), leishmanial (L. major) a...
In DepthDetails US Patent
TargetGlycylpeptide N-tetradecanoyltransferase(Leishmania major)
Univeristy Of Dundee
US Patent
LigandPNGBDBM185094(US9156811, DDD100800)
Affinity DataIC50:  73nMpH: 7.4 T: 2°C. Assay description: Measurement of the ability of compounds to inhibit the NMT-1 and/or NMT-2 enzyme isoforms of human, trypanosome (T. brucei), leishmanial (L. major) a...
In DepthDetails US Patent
TargetGlycylpeptide N-tetradecanoyltransferase 1(Homo sapiens (Human))
Univeristy Of Dundee
US Patent
LigandPNGBDBM185094(US9156811, DDD100800)
Affinity DataIC50:  21nMpH: 7.4 T: 2°C. Assay description: Measurement of the ability of compounds to inhibit the NMT-1 and/or NMT-2 enzyme isoforms of human, trypanosome (T. brucei), leishmanial (L. major) a...
In DepthDetails US Patent