BDBM185167 (4-Methoxycarbonylphenyl)methyl 4-[2-[(2-bromoacetyl)amino]acetyl]piperazine-1-carboxylate (6b)
SMILES COC(=O)c1ccc(COC(=O)N2CCN(CC2)C(=O)CNC(=O)CBr)cc1
InChI Key InChIKey=DHKHYJYAEPJCDA-UHFFFAOYSA-N
Data  1 IC50
  Tab Delimited (TSV)   2D SDfile   Computed 3D by Vconf -m prep SDfile
Find this compound or compounds like it in BindingDB:
Activity Spreadsheet -- Enzyme Inhibition Constant Data from BindingDB
Found 1 hit for monomerid = 185167
TargetProtein-glutamine gamma-glutamyltransferase 2(Homo sapiens (Human))
Aston University
LigandPNGBDBM185167((4-Methoxycarbonylphenyl)methyl 4-[2-[(2-bromoacet...)
Affinity DataIC50:  2.10nM. Assay description: For measurement of TG2 activity, the incorporation of biotinylated cadaverineinto immobilized N,N-dimethylcasein was used as described previously (Wa...
In DepthDetails ArticlePubMed