BDBM185476 US9156845, 129
SMILES NC1CCCN(C1)c1ncnc2[nH]cc(-c3cccc(c3)C#N)c12
InChI Key
Data  2 IC50
  Tab Delimited (TSV)   2D SDfile   Computed 3D by Vconf -m prep SDfile
Find this compound or compounds like it in BindingDB:
Activity Spreadsheet -- Enzyme Inhibition Constant Data from BindingDB
Found 2 hits for monomerid = 185476
TargetLeucine-rich repeat serine/threonine-protein kinase 2 [G2019S](Homo sapiens (Human))
Pfizer
US Patent
LigandPNGBDBM185476(US9156845, 129)
Affinity DataIC50:  21nMpH: 7.5Assay Description:LRRK2 kinase activity was measured using Lantha Screen technology from Invitrogen. GST-tagged truncated LRRK2 from Invitrogen (Cat # PV4874) was incu...
In DepthDetails US Patent
TargetLeucine-rich repeat serine/threonine-protein kinase 2(Homo sapiens (Human))
Pfizer
US Patent
LigandPNGBDBM185476(US9156845, 129)
Affinity DataIC50:  14nMpH: 7.5Assay Description:LRRK2 kinase activity was measured using Lantha Screen technology from Invitrogen. GST-tagged truncated LRRK2 from Invitrogen (Cat # PV4874) was incu...
In DepthDetails US Patent