BDBM185487 US9156845, 140
SMILES CCC1CN(CCO1)c1ncnc2[nH]cc(-c3cccc(c3)C#N)c12
InChI Key
Data  2 IC50
  Tab Delimited (TSV)   2D SDfile   Computed 3D by Vconf -m prep SDfile
Find this compound or compounds like it in BindingDB:
Activity Spreadsheet -- Enzyme Inhibition Constant Data from BindingDB
Found 2 hits for monomerid = 185487
TargetLeucine-rich repeat serine/threonine-protein kinase 2 [G2019S](Homo sapiens (Human))
Pfizer
US Patent
LigandPNGBDBM185487(US9156845, 140)
Affinity DataIC50:  95nMpH: 7.5Assay Description:LRRK2 kinase activity was measured using Lantha Screen technology from Invitrogen. GST-tagged truncated LRRK2 from Invitrogen (Cat # PV4874) was incu...
In DepthDetails US Patent
TargetLeucine-rich repeat serine/threonine-protein kinase 2(Homo sapiens (Human))
Pfizer
US Patent
LigandPNGBDBM185487(US9156845, 140)
Affinity DataIC50:  61nMpH: 7.5Assay Description:LRRK2 kinase activity was measured using Lantha Screen technology from Invitrogen. GST-tagged truncated LRRK2 from Invitrogen (Cat # PV4874) was incu...
In DepthDetails US Patent