BDBM185613 US9156856, 24::US9493431, 24
SMILES Cc1nsc(c1Cl)S(=O)(=O)NC(=O)c1ccc(cc1)N1CCN(Cc2ccccc2-c2ccc(Cl)cc2)CC1
InChI Key InChIKey=KBSKUHKYNUKOMS-UHFFFAOYSA-N
Data  2 KI
  Tab Delimited (TSV)   2D SDfile   Computed 3D by Vconf -m prep SDfile
Find this compound or compounds like it in BindingDB:
Activity Spreadsheet -- Enzyme Inhibition Constant Data from BindingDB
Found 2 hits for monomerid = 185613
TargetApoptosis regulator Bcl-2/Glutathione S-transferase P(Homo sapiens (Human))
Abbvie
US Patent
LigandPNGBDBM185613(US9156856, 24 | US9493431, 24)
Affinity DataKi:  342nM ΔG°:  -8.81kcal/moleT: 2°C. Assay description: Representative compounds were serially diluted in dimethyl sulfoxide (DMSO) starting at 50 uM (2x starting concentration; 10% DMSO) and 10 uL were tr...
Ligand InfoPC cidPC sid
In DepthDetails US Patent
TargetBcl-2-like protein 1(Homo sapiens (Human))
Abbvie
US Patent
LigandPNGBDBM185613(US9156856, 24 | US9493431, 24)
Affinity DataKi:  342nM ΔG°:  -8.81kcal/moleT: 2°C. Assay description: Representative compounds were serially diluted in dimethyl sulfoxide (DMSO) starting at 50 μM (2× starting concentration; 10% DMSO) and 10 μ...
Ligand InfoPC cidPC sid
In DepthDetails US Patent