BDBM185645 US9161922, Table 1, Compound 11
SMILES NC\C=C/Cl
InChI Key InChIKey=ZOGFQDXLOXDFHI-UPHRSURJSA-N
Data  1 IC50
  Tab Delimited (TSV)   2D SDfile   Computed 3D by Vconf -m prep SDfile
Find this compound or compounds like it in BindingDB:
Activity Spreadsheet -- Enzyme Inhibition Constant Data from BindingDB
Found 1 hit for monomerid = 185645
TargetMembrane primary amine oxidase(Bos taurus (Bovine))
Case Western Reserve University
US Patent
LigandPNGBDBM185645(US9161922, Table 1, Compound 11)
Affinity DataIC50:  1.10E+4nMpH: 7.2 T: 2°C. Assay description: In the following Examples, 0.9 mL aliquots of a solution of candidate inhibitor in 100 mM potassium phosphate buffer, pH 7.2 was mixed bovine plasma ...
In DepthDetails US Patent