BDBM185655 US9161922, Table 2, Compound 10
SMILES NCCC#C[N+]#[C-]
InChI Key InChIKey=ITMNVYLVSMTROP-UHFFFAOYSA-N
Data  1 IC50
  Tab Delimited (TSV)   2D SDfile   Computed 3D by Vconf -m prep SDfile
Find this compound or compounds like it in BindingDB:
Activity Spreadsheet -- Enzyme Inhibition Constant Data from BindingDB
Found 1 hit for monomerid = 185655
TargetMembrane primary amine oxidase(Bos taurus (Bovine))
Case Western Reserve University
US Patent
LigandPNGBDBM185655(US9161922, Table 2, Compound 10)
Affinity DataIC50:  2.00E+3nMpH: 7.2 T: 2°C. Assay description: In the following Examples, 0.9 mL aliquots of a solution of candidate inhibitor in 100 mM potassium phosphate buffer, pH 7.2 was mixed bovine plasma ...
Ligand InfoPC cidPC sid
In DepthDetails US Patent