BDBM185875 US9163007, 254
SMILES O=C(NCCN1CCOCC1)c1c(nnn1Cc1ccccc1)-c1ccc2[nH]ncc2c1
InChI Key InChIKey=BTDQSCBIBJYKJJ-UHFFFAOYSA-N
Data  1 KI
  Tab Delimited (TSV)   2D SDfile   Computed 3D by Vconf -m prep SDfile
Find this compound or compounds like it in BindingDB:
Activity Spreadsheet -- Enzyme Inhibition Constant Data from BindingDB
Found 1 hit for monomerid = 185875
TargetCell division cycle 7-related protein kinase(Homo sapiens (Human))
Abbvie
US Patent
LigandPNGBDBM185875(US9163007, 254)
Affinity DataKi: >1.23E+3nMpH: 7.5Assay Description:6 data point. Cdc7 kinase assays were carried out in 25 mM HEPES, pH 7.5, 1 mM DTT, 10 mM MgCl2, 100 μM Na3VO4, and 0.075 mg/ml Triton X-100 us...
In DepthDetails US Patent