BDBM185926 US9163008, 15::US9656968, Compound 15
SMILES COC(=O)[C@@H]1CCCN1c1cc(nc(n1)-c1ccc(Oc2ccc(F)cc2)cc1)C(N)=O
InChI Key InChIKey=QGRBLKXOJKNYBN-IBGZPJMESA-N
Data  2 KI  2 IC50
  Tab Delimited (TSV)   2D SDfile   Computed 3D by Vconf -m prep SDfile
Find this compound or compounds like it in BindingDB:
Activity Spreadsheet -- Enzyme Inhibition Constant Data from BindingDB
Found 4 hits for monomerid = 185926
TargetSodium channel protein type 9 subunit alpha(Homo sapiens (Human))
Purdue Pharma
US Patent
LigandPNGBDBM185926(US9163008, 15 | US9656968, Compound 15)
Affinity DataKi:  350nMpH: 7.4Assay Description:For electrophysiological recordings the external solution was either standard, DMEM supplemented with 10 mM HEPES (pH adjusted to 7.34 with NaOH and ...
In DepthDetails US Patent
TargetSodium channel protein type 9 subunit alpha(Homo sapiens (Human))
Purdue Pharma
US Patent
LigandPNGBDBM185926(US9163008, 15 | US9656968, Compound 15)
Affinity DataKi:  350nM. Assay description: Cells: The hNav1.7 expressing HEK-293 cells were plated on 35 mm culture dishes pre-coated with poly-D-lysine in standard DMEM culture media (Mediate...
In DepthDetails US Patent
TargetSodium channel protein type 9 subunit alpha(Homo sapiens (Human))
Purdue Pharma
US Patent
LigandPNGBDBM185926(US9163008, 15 | US9656968, Compound 15)
Affinity DataIC50:  860nM. Assay description: Assay Buffer: The assay buffer was formulated by removing 120 mL from a 1 L bottle of fresh, sterile dH2O (Mediatech, Herndon, Va.) and adding 100 mL...
In DepthDetails US Patent
TargetSodium channel protein type 9 subunit alpha(Homo sapiens (Human))
Purdue Pharma
US Patent
LigandPNGBDBM185926(US9163008, 15 | US9656968, Compound 15)
Affinity DataIC50:  860nM. Assay description: In vitro assays were performed in a recombinant cell line expressing cDNA encoding the alpha subunit (Nav1.7, SCN9a, PN1, NE) of human Nav1.7 (Access...
In DepthDetails US Patent