BDBM185944 US9163008, 33::US9656968, Compound 33
SMILES COC(=O)[C@H](C)Nc1cc(nc(n1)-c1ccc(Oc2ccc(F)cc2)cc1)C(O)=O
InChI Key InChIKey=WCRBNOREWVLNLP-LBPRGKRZSA-N
Data  2 IC50
  Tab Delimited (TSV)   2D SDfile   Computed 3D by Vconf -m prep SDfile
Find this compound or compounds like it in BindingDB:
Activity Spreadsheet -- Enzyme Inhibition Constant Data from BindingDB
Found 2 hits for monomerid = 185944
TargetSodium channel protein type 9 subunit alpha(Homo sapiens (Human))
TBA
US Patent
LigandPNGBDBM185944(US9163008, 33 | US9656968, Compound 33)
Affinity DataIC50:  970nM. Assay description: Assay Buffer: The assay buffer was formulated by removing 120 mL from a 1 L bottle of fresh, sterile dH2O (Mediatech, Herndon, Va.) and adding 100 mL...
In DepthDetails US Patent
TargetSodium channel protein type 9 subunit alpha(Homo sapiens (Human))
TBA
US Patent
LigandPNGBDBM185944(US9163008, 33 | US9656968, Compound 33)
Affinity DataIC50:  970nM. Assay description: In vitro assays were performed in a recombinant cell line expressing cDNA encoding the alpha subunit (Nav1.7, SCN9a, PN1, NE) of human Nav1.7 (Access...
In DepthDetails US Patent