BDBM18610 6-[(2,2,2-trifluoroethyl)[(2R)-1,1,1-trifluoropropan-2-yl]amino]-4-(trifluoromethyl)-1,2-dihydroquinolin-2-one::6-bisalkylamino-2-quinolinone, 8a
SMILES C[C@@H](N(CC(F)(F)F)c1ccc2[nH]c(=O)cc(c2c1)C(F)(F)F)C(F)(F)F
InChI Key InChIKey=SUBOLNIDKQTFIM-SSDOTTSWSA-N
Data  1 KI  1 EC50
  Tab Delimited (TSV)   2D SDfile   Computed 3D by Vconf -m prep SDfile
Find this compound or compounds like it in BindingDB:
Activity Spreadsheet -- Enzyme Inhibition Constant Data from BindingDB
Found 1 hit for monomerid = 18610
TargetAndrogen receptor(Homo sapiens (Human))
Ligand Pharmaceuticals
LigandPNGBDBM18610(6-[(2,2,2-trifluoroethyl)[(2R)-1,1,1-trifluoroprop...)
Affinity DataKi:  9.20nM EC50:  2.30nM. Assay description: The compounds were evaluated in a transcriptional activation assay with hAR in a mammalian cell background (CV-1) as the primary in vitro assay. Rece...
In DepthDetails ArticlePubMed