BDBM186191 US9163013, 8
SMILES COc1ccc2[nH]nc(C(=O)NCC3CCN(Cc4nc(cs4)C(O)=O)CC3)c2c1
InChI Key InChIKey=GEAOHLKIGUKERJ-UHFFFAOYSA-N
Data  1 IC50
  Tab Delimited (TSV)   2D SDfile   Computed 3D by Vconf -m prep SDfile
Find this compound or compounds like it in BindingDB:
Activity Spreadsheet -- Enzyme Inhibition Constant Data from BindingDB
Found 1 hit for monomerid = 186191
TargetGlycogen synthase kinase-3 beta(Homo sapiens (Human))
Aziende Chimiche Riunite Angelini Francesco A.C.R.A.F.
US Patent
LigandPNGBDBM186191(US9163013, 8)
Affinity DataIC50:  170nMT: 2°C. Assay description: Activity on human GSK-3beta was assessed using the following methods (according to Meijer et al., Chem. Biol., 2003-10:1255-1266).In a first screenin...
In DepthDetails US Patent