BDBM18647 (2R,5S)-4-[4-cyano-3-(trifluoromethyl)phenyl]-N-(4-methoxypyridin-3-yl)-2,5-dimethylpiperazine-1-carboxamide::N-Arylpiperazine-1-carboxamide Derivative, 24
SMILES COc1ccncc1NC(=O)N1C[C@H](C)N(C[C@H]1C)c1ccc(C#N)c(c1)C(F)(F)F
InChI Key InChIKey=TVLWNDHVNHEARD-UONOGXRCSA-N
Data  1 IC50
  Tab Delimited (TSV)   2D SDfile   Computed 3D by Vconf -m prep SDfile
Find this compound or compounds like it in BindingDB:
Activity Spreadsheet -- Enzyme Inhibition Constant Data from BindingDB
Found 1 hit for monomerid = 18647
TargetAndrogen receptor(Homo sapiens (Human))
Astellas Pharma
LigandPNGBDBM18647((2R,5S)-4-[4-cyano-3-(trifluoromethyl)phenyl]-N-(4...)
Affinity DataIC50:  1.20E+3nMpH: 7.8Assay Description:Activities of the test compounds to inhibit androgen receptor mediated transcription induced by DHT were evaluated using stable transfected AR/CHO#3 ...
In DepthDetails ArticlePubMed