BDBM18677 (2S)-3-[(4-acetamidophenyl)amino]-2-hydroxy-2-methyl-N-[4-nitro-3-(trifluoromethyl)phenyl]propanamide::Nonsteroidal AR Ligand, S-18
SMILES CC(=O)Nc1ccc(NC[C@](C)(O)C(=O)Nc2ccc(c(c2)C(F)(F)F)[N+]([O-])=O)cc1
InChI Key InChIKey=VDCVMSYLCTUWSX-SFHVURJKSA-N
Data  1 KI
  Tab Delimited (TSV)   2D SDfile   Computed 3D by Vconf -m prep SDfile
Find this compound or compounds like it in BindingDB:
Activity Spreadsheet -- Enzyme Inhibition Constant Data from BindingDB
Found 1 hit for monomerid = 18677
TargetAndrogen receptor(Rattus norvegicus (Rat))
University Of Tennessee At Memphis
LigandPNGBDBM18677((2S)-3-[(4-acetamidophenyl)amino]-2-hydroxy-2-meth...)
Affinity DataKi:  128nM ΔG°:  -8.73kcal/molepH: 7.4 T: 2°C. Assay description: The Ki values were determined by the application of the Cheng-Prusoff equation: Ki = (IC50 x Kd)/(Kd+[L]) where [L] is the concentration of [3H]MIB (...
In DepthDetails ArticlePubMed