BDBM186850 US9670157, 16 2,5-Dimethyl-1-(6-phenyl-pyridin-2-ylmethyl)-1H-pyrrole-3-carboxylic acid 4-aminomethyl-benzylamide::US9834513, 16
SMILES Cc1cc(C(=O)NCc2ccc(CN)cc2)c(C)n1Cc1cccc(n1)-c1ccccc1
InChI Key InChIKey=ANTXTTKCONNLSC-UHFFFAOYSA-N
Data  4 IC50
  Tab Delimited (TSV)   2D SDfile   Computed 3D by Vconf -m prep SDfile
Find this compound or compounds like it in BindingDB:
Activity Spreadsheet -- Enzyme Inhibition Constant Data from BindingDB
Found 4 hits for monomerid = 186850
TargetPlasma kallikrein(Homo sapiens (Human))
Kalvista Pharmaceuticals
US Patent
LigandPNGBDBM186850(US9670157, 16 2,5-Dimethyl-1-(6-phenyl-pyridin-2-y...)
Affinity DataIC50:  186nM. Assay description: Plasma kallikrein inhibitory activity in vitro was determined using standard published methods (see e.g. Johansen et al., Int. J. Tiss. Reac. 1986, 8...
Ligand InfoPC cidPC sid
In DepthDetails US Patent
TargetKallikrein-1(Homo sapiens (Human))
Kalvista Pharmceuticals
US Patent
LigandPNGBDBM186850(US9670157, 16 2,5-Dimethyl-1-(6-phenyl-pyridin-2-y...)
Affinity DataIC50:  1.00E+4nM. Assay description: KLK1 inhibitory activity in vitro was determined using standard published methods (see e.g. Johansen et al., Int. J. Tiss. Reac. 1986, 8, 185; Shori ...
Ligand InfoPC cidPC sid
In DepthDetails US Patent
TargetPlasma kallikrein(Homo sapiens (Human))
Kalvista Pharmaceuticals
US Patent
LigandPNGBDBM186850(US9670157, 16 2,5-Dimethyl-1-(6-phenyl-pyridin-2-y...)
Affinity DataIC50:  186nM. Assay description: Plasma kallikrein inhibitory activity in vitro was determined using standard published methods (see e.g. Johansen et al., Int. J. Tiss. Reac. 1986, 8...
Ligand InfoPC cidPC sid
In DepthDetails US Patent
TargetKallikrein-1(Homo sapiens (Human))
Kalvista Pharmceuticals
US Patent
LigandPNGBDBM186850(US9670157, 16 2,5-Dimethyl-1-(6-phenyl-pyridin-2-y...)
Affinity DataIC50: >1.00E+4nM. Assay description: KLK1 inhibitory activity in vitro was determined using standard published methods (see e.g. Johansen et al., Int. J. Tiss. Reac. 1986, 8, 185; Shori ...
Ligand InfoPC cidPC sid
In DepthDetails US Patent