BDBM186923 US9079895, 15r
SMILES C(CN1CCO[C@@H](COc2ccccn2)C1)N1CCc2ccccc12
InChI Key InChIKey=DSTWBFPFQZUGGQ-GOSISDBHSA-N
Data  4 KI
  Tab Delimited (TSV)   2D SDfile   Computed 3D by Vconf -m prep SDfile
Find this compound or compounds like it in BindingDB:
Activity Spreadsheet -- Enzyme Inhibition Constant Data from BindingDB
Found 4 hits for monomerid = 186923
Target5-hydroxytryptamine receptor 2B(Mus musculus (Mouse))
University Of Dundee
US Patent
LigandPNGBDBM186923(US9079895, 15r)
Affinity DataKi:  600nMpH: 7.4Assay Description:The detailed experimental protocols for the radioligand and functional receptor assays are available on the NIMH PDSP website at http://pdsp.med.un...
In DepthDetails US Patent
TargetD(4) dopamine receptor(Mus musculus (Mouse))
University Of Dundee
US Patent
LigandPNGBDBM186923(US9079895, 15r)
Affinity DataKi:  814nMpH: 7.4Assay Description:The detailed experimental protocols for the radioligand and functional receptor assays are available on the NIMH PDSP website at http://pdsp.med.un...
In DepthDetails US Patent
Target5-hydroxytryptamine receptor 1A(Mus musculus (Mouse))
University Of Dundee
US Patent
LigandPNGBDBM186923(US9079895, 15r)
Affinity DataKi:  2.88E+3nMpH: 7.4Assay Description:The detailed experimental protocols for the radioligand and functional receptor assays are available on the NIMH PDSP website at http://pdsp.med.un...
In DepthDetails US Patent
TargetD(3) dopamine receptor(Mus musculus (Mouse))
University Of Dundee
US Patent
LigandPNGBDBM186923(US9079895, 15r)
Affinity DataKi: >1.00E+4nMpH: 7.4Assay Description:The detailed experimental protocols for the radioligand and functional receptor assays are available on the NIMH PDSP website at http://pdsp.med.un...
In DepthDetails US Patent