BDBM186995 US9169209, Table 3, Compound 26
SMILES FC(F)(F)c1ccc(cc1Cl)S(=O)(=O)c1ccc(NC(=O)\C=C\c2cccnc2)cc1
InChI Key InChIKey=JBGVNUXJIXGAOV-XCVCLJGOSA-N
Data  1 IC50
  Tab Delimited (TSV)   2D SDfile   Computed 3D by Vconf -m prep SDfile
Find this compound or compounds like it in BindingDB:
Activity Spreadsheet -- Enzyme Inhibition Constant Data from BindingDB
Found 1 hit for monomerid = 186995
TargetNicotinamide phosphoribosyltransferase(Homo sapiens (Human))
Forma Tm
US Patent
LigandPNGBDBM186995(US9169209, Table 3, Compound 26)
Affinity DataIC50:  43.4nMpH: 7.5 T: 2°C. Assay description: The NAMPT enzymatic reactions were carried out in Buffer A (50 mM Hepes pH 7.5, 50 mM NaCl, 5 mM MgCl2, and 1 mM THP) in 96-well V-bottom plates. The...
In DepthDetails US Patent