BDBM187007 US9169209, Table 3, Compound 39
SMILES Cn1ncc2cc(ccc12)S(=O)(=O)c1ccc(NC(=O)\C=C\c2cccnc2)cc1
InChI Key InChIKey=ZCXGPBVAHLFAGC-NYYWCZLTSA-N
Data  1 IC50
  Tab Delimited (TSV)   2D SDfile   Computed 3D by Vconf -m prep SDfile
Find this compound or compounds like it in BindingDB:
Activity Spreadsheet -- Enzyme Inhibition Constant Data from BindingDB
Found 1 hit for monomerid = 187007
TargetNicotinamide phosphoribosyltransferase(Homo sapiens (Human))
Forma Tm
US Patent
LigandPNGBDBM187007(US9169209, Table 3, Compound 39)
Affinity DataIC50:  1.90nMpH: 7.5 T: 2°C. Assay description: The NAMPT enzymatic reactions were carried out in Buffer A (50 mM Hepes pH 7.5, 50 mM NaCl, 5 mM MgCl2, and 1 mM THP) in 96-well V-bottom plates. The...
In DepthDetails US Patent