BDBM18702 dihydroquinoline compound, 14::{[6-(2-methoxyphenyl)-2,2-dimethyl-1,2-dihydroquinolin-4-yl]methyl}(prop-2-en-1-yl)amine
SMILES COc1ccccc1-c1ccc2NC(C)(C)C=C(CNCC=C)c2c1
InChI Key InChIKey=FYPGSJVROLPAHA-UHFFFAOYSA-N
Data  2 IC50
  Tab Delimited (TSV)   2D SDfile   Computed 3D by Vconf -m prep SDfile
Find this compound or compounds like it in BindingDB:
Activity Spreadsheet -- Enzyme Inhibition Constant Data from BindingDB
Found 2 hits for monomerid = 18702
TargetProgesterone receptor(Homo sapiens (Human))
Boehringer Ingelheim Pharmaceuticals
LigandPNGBDBM18702(dihydroquinoline compound, 14 | {[6-(2-methoxyphen...)
Affinity DataIC50: >2.00E+3nM. Assay description: IC50 values shown are means of a single experiment done in duplicate 11-point concentration-effect curves.
In DepthDetails ArticlePubMed
TargetGlucocorticoid receptor(Homo sapiens (Human))
Boehringer Ingelheim Pharmaceuticals
LigandPNGBDBM18702(dihydroquinoline compound, 14 | {[6-(2-methoxyphen...)
Affinity DataIC50: >2.00E+3nMpH: 7.4 T: 2°C. Assay description: IC50 values shown are means of a single experiment done in duplicate 11-point concentration-effect curves.
In DepthDetails ArticlePubMed