BDBM187136 US9670181, 16 6,7-dimethoxy-4-((5-(4-methoxyphenyl)pyridin-3-yl)methyl)-1-methylisoquinolin-
SMILES COc1ccc(cc1)-c1cncc(Cc2c(O)nc(C)c3cc(OC)c(OC)cc23)c1
InChI Key InChIKey=PZGMSPJSIGMXQV-UHFFFAOYSA-N
Data  1 IC50
  Tab Delimited (TSV)   2D SDfile   Computed 3D by Vconf -m prep SDfile
Find this compound or compounds like it in BindingDB:
Activity Spreadsheet -- Enzyme Inhibition Constant Data from BindingDB
Found 1 hit for monomerid = 187136
TargetcAMP and cAMP-inhibited cGMP 3',5'-cyclic phosphodiesterase 10A(Homo sapiens (Human))
Allergan
US Patent
LigandPNGBDBM187136(US9670181, 16 6,7-dimethoxy-4-((5-(4-methoxyphenyl...)
Affinity DataIC50:  69nMpH: 7.4 T: 2°C. Assay description: The PDE assay is based on the homogenous time-resolved fluorescence resonance energy transfer (TR-FRET) technology (LANCE® from Perkin Elmer). This c...
Ligand InfoPC cidPC sid
In DepthDetails US Patent