BDBM187253 US9169234, 16
SMILES COCC(=O)NCCc1c[nH]c2ccc(F)cc12
InChI Key InChIKey=HGKSZORVNFVLMC-UHFFFAOYSA-N
Data  2 IC50
  Tab Delimited (TSV)   2D SDfile   Computed 3D by Vconf -m prep SDfile
Find this compound or compounds like it in BindingDB:
Activity Spreadsheet -- Enzyme Inhibition Constant Data from BindingDB
Found 2 hits for monomerid = 187253
TargetSepiapterin reductase(Homo sapiens (Human))
Solace Pharmaceuticals
US Patent
LigandPNGBDBM187253(US9169234, 16)
Affinity DataIC50:  3.40E+3nMpH: 6.5 T: 2°C. Assay description: To screen for SPR inhibition, a biochemical assay based on LC/MS (and chromogenic) read-out has been developed. The LC/MS assay monitors the produc...
In DepthDetails US Patent
TargetSepiapterin reductase(Homo sapiens (Human))
Solace Pharmaceuticals
US Patent
LigandPNGBDBM187253(US9169234, 16)
Affinity DataIC50:  2.80E+3nMpH: 6.5 T: 2°C. Assay description: To screen for SPR inhibition, a biochemical assay based on LC/MS (and chromogenic) read-out has been developed. The LC/MS assay monitors the product ...
In DepthDetails US Patent