BDBM187368 US9169243, 16::US9908875, 16
SMILES O=C(Nc1csc(n1)-c1nncn1C1CC1)c1cc(c(cn1)N1CCN2C(COC2=O)C1)-n1cnc(c1)C1CC1
InChI Key InChIKey=AFELNRHIXXVTNY-UHFFFAOYSA-N
Data  2 IC50
  Tab Delimited (TSV)   2D SDfile   Computed 3D by Vconf -m prep SDfile
Find this compound or compounds like it in BindingDB:
Activity Spreadsheet -- Enzyme Inhibition Constant Data from BindingDB
Found 2 hits for monomerid = 187368
TargetMitogen-activated protein kinase kinase kinase 5(Homo sapiens (Human))
Gilead Sciences
US Patent
LigandPNGBDBM187368(US9169243, 16 | US9908875, 16)
Affinity DataIC50:  2.70nM. Assay description: The assay measures the phosphorylation level of a biotinylated peptide substrate by the ASK1 kinase using HTRF detection. This is a competitive, time...
In DepthDetails US Patent
TargetRAC-alpha serine/threonine-protein kinase(Homo sapiens (Human))
Gilead Sciences
US Patent
LigandPNGBDBM187368(US9169243, 16 | US9908875, 16)
Affinity DataIC50:  2.70nM. Assay description: The assay measures the phosphorylation level of a biotinylated peptide substrate by the ASK1 kinase using HTRF detection. This is a competitive, time...
In DepthDetails US Patent