BDBM187374 US9169243, 22::US9908875, 22
SMILES O=C(Nc1csc(n1)-c1nncn1C1CC1)c1cc(c(cn1)N1CC2(C1)CCOCC2)-n1cnc(c1)C1CC1
InChI Key InChIKey=RBWSGKOQHNYLTK-UHFFFAOYSA-N
Data  2 IC50
  Tab Delimited (TSV)   2D SDfile   Computed 3D by Vconf -m prep SDfile
Find this compound or compounds like it in BindingDB:
Activity Spreadsheet -- Enzyme Inhibition Constant Data from BindingDB
Found 2 hits for monomerid = 187374
TargetMitogen-activated protein kinase kinase kinase 5(Homo sapiens (Human))
Gilead Sciences
US Patent
LigandPNGBDBM187374(US9169243, 22 | US9908875, 22)
Affinity DataIC50:  4.5nM. Assay description: The assay measures the phosphorylation level of a biotinylated peptide substrate by the ASK1 kinase using HTRF detection. This is a competitive, time...
In DepthDetails US Patent
TargetRAC-alpha serine/threonine-protein kinase(Homo sapiens (Human))
Gilead Sciences
US Patent
LigandPNGBDBM187374(US9169243, 22 | US9908875, 22)
Affinity DataIC50:  4.5nM. Assay description: The assay measures the phosphorylation level of a biotinylated peptide substrate by the ASK1 kinase using HTRF detection. This is a competitive, time...
In DepthDetails US Patent