BDBM187393 US9169243, 41::US9908875, 41
SMILES C[C@H](n1cnnc1-c1nc(NC(=O)c2cc(c(cn2)N2CC(C2)N2CCOCC2)-n2cnc(c2)C2CC2)cs1)C(F)(F)F
InChI Key InChIKey=UVUZEPPXWNQQIU-INIZCTEOSA-N
Data  2 IC50
  Tab Delimited (TSV)   2D SDfile   Computed 3D by Vconf -m prep SDfile
Find this compound or compounds like it in BindingDB:
Activity Spreadsheet -- Enzyme Inhibition Constant Data from BindingDB
Found 2 hits for monomerid = 187393
TargetMitogen-activated protein kinase kinase kinase 5(Homo sapiens (Human))
Gilead Sciences
US Patent
LigandPNGBDBM187393(US9169243, 41 | US9908875, 41)
Affinity DataIC50:  1.90nM. Assay description: The assay measures the phosphorylation level of a biotinylated peptide substrate by the ASK1 kinase using HTRF detection. This is a competitive, time...
In DepthDetails US Patent
TargetRAC-alpha serine/threonine-protein kinase(Homo sapiens (Human))
Gilead Sciences
US Patent
LigandPNGBDBM187393(US9169243, 41 | US9908875, 41)
Affinity DataIC50:  1.90nM. Assay description: The assay measures the phosphorylation level of a biotinylated peptide substrate by the ASK1 kinase using HTRF detection. This is a competitive, time...
In DepthDetails US Patent