BDBM188044 US9169252, 578
SMILES CCCNc1cc(ncc1C(=O)NC[C@@H](F)C(C)(C)O)-n1ncc2cc(C#N)c(N)nc12
InChI Key InChIKey=QRPPVEMATFPXNI-MRXNPFEDSA-N
Data  1 IC50
  Tab Delimited (TSV)   2D SDfile   Computed 3D by Vconf -m prep SDfile
Find this compound or compounds like it in BindingDB:
Activity Spreadsheet -- Enzyme Inhibition Constant Data from BindingDB
Found 1 hit for monomerid = 188044
TargetInterleukin-1 receptor-associated kinase 4(Homo sapiens (Human))
Bristol-Myers Squibb
US Patent
LigandPNGBDBM188044(US9169252, 578)
Affinity DataIC50:  2.60nMpH: 7.2Assay Description:The assays were performed in U-bottom 384-well plates. The final assay volume was 30 L prepared from 15 L additions of enzyme and substrates (fluores...
In DepthDetails US Patent