BDBM188128 US9169259, I-10
SMILES CC1CCCN1c1cccc(Nc2cc(nn3ccnc23)-c2cccc(c2)C(=O)Nc2ccc(cc2)C(O)=O)n1
InChI Key InChIKey=XUGAKPAMKMUPTP-UHFFFAOYSA-N
Data  1 IC50
  Tab Delimited (TSV)   2D SDfile   Computed 3D by Vconf -m prep SDfile
Find this compound or compounds like it in BindingDB:
Activity Spreadsheet -- Enzyme Inhibition Constant Data from BindingDB
Found 1 hit for monomerid = 188128
TargetTyrosine-protein kinase SYK [360-635](Homo sapiens (Human))
Hoffmann-La Roche
US Patent
LigandPNGBDBM188128(US9169259, I-10)
Affinity DataIC50:  1.65nM. Assay description: Assay plates: 96-well MultiScreen 0.65 um filter plates (Millipore Cat. No.: MADVNOB10)Streptavidin coated beads: Streptavidin Sepharose, suspension ...
In DepthDetails US Patent