BDBM188137 US9169259, I-19
SMILES CC1CCCN1c1cccc(Nc2cc(nn3ccnc23)-c2ccc3cn[nH]c3c2)n1
InChI Key
Data  1 IC50
  Tab Delimited (TSV)   2D SDfile   Computed 3D by Vconf -m prep SDfile
Find this compound or compounds like it in BindingDB:
Activity Spreadsheet -- Enzyme Inhibition Constant Data from BindingDB
Found 1 hit for monomerid = 188137
TargetTyrosine-protein kinase SYK [360-635](Homo sapiens (Human))
Hoffmann-La Roche
US Patent
LigandPNGBDBM188137(US9169259, I-19)
Affinity DataIC50:  75nM. Assay description: Assay plates: 96-well MultiScreen 0.65 um filter plates (Millipore Cat. No.: MADVNOB10)Streptavidin coated beads: Streptavidin Sepharose, suspension ...
In DepthDetails US Patent