BDBM188237 US9073941, 519
SMILES CC(C)n1cnc(c1)S(=O)(=O)N1CCC(CC1)C(=O)Nc1cccc(Br)c1
InChI Key InChIKey=CZBIXKYBCMNNQB-UHFFFAOYSA-N
Data  1 IC50
  Tab Delimited (TSV)   2D SDfile   Computed 3D by Vconf -m prep SDfile
Find this compound or compounds like it in BindingDB:
Activity Spreadsheet -- Enzyme Inhibition Constant Data from BindingDB
Found 1 hit for monomerid = 188237
TargetDihydrolipoyl dehydrogenase(Mycobacterium tuberculosis)
Academia Sinica
US Patent
LigandPNGBDBM188237(US9073941, 519)
Affinity DataIC50:  2.76E+3nMpH: 7.0Assay Description:The assay was performed in a manner similar to that described in Bryk et al., Biochemistry (2010) 49:1616-1627 and modified for an online robotics sc...
In DepthDetails US Patent