BDBM188300 US9073941, 805
SMILES Cc1ccc2cc(CNc3ccc(O)cc3)c(O)nc2c1
InChI Key InChIKey=DQDCZFXLHHUSBZ-UHFFFAOYSA-N
Data  1 IC50
  Tab Delimited (TSV)   2D SDfile   Computed 3D by Vconf -m prep SDfile
Find this compound or compounds like it in BindingDB:
Activity Spreadsheet -- Enzyme Inhibition Constant Data from BindingDB
Found 1 hit for monomerid = 188300
TargetDihydrolipoyl dehydrogenase(Mycobacterium tuberculosis)
Academia Sinica
US Patent
LigandPNGBDBM188300(US9073941, 805)
Affinity DataIC50:  1.64E+3nMpH: 7.0Assay Description:The assay was performed in a manner similar to that described in Bryk et al., Biochemistry (2010) 49:1616-1627 and modified for an online robotics sc...
In DepthDetails US Patent