BDBM18832 1-(4-hexylphenyl)propan-1-one::Enone, 4g
SMILES CCCCCCc1ccc(cc1)C(=O)CC
InChI Key InChIKey=NRSLKKPSVPOIBM-UHFFFAOYSA-N
Data  2 IC50
  Tab Delimited (TSV)   2D SDfile   Computed 3D by Vconf -m prep SDfile
Find this compound or compounds like it in BindingDB:
Activity Spreadsheet -- Enzyme Inhibition Constant Data from BindingDB
Found 2 hits for monomerid = 18832
TargetThyroid hormone receptor beta [209-461](Homo sapiens (Human))
St. Jude Research Hospital
LigandPNGBDBM18832(1-(4-hexylphenyl)propan-1-one | Enone, 4g)
Affinity DataIC50: >1.00E+5nM. Assay description: IC50 is the concentration of each compound required to inhibit 50% of the binding between the TR LBD and the SRC2-2 peptide using fluorescence polari...
In DepthDetails ArticlePubMedMMDB
TargetThyroid hormone receptor alpha [148-410](Homo sapiens (Human))
St. Jude Research Hospital
LigandPNGBDBM18832(1-(4-hexylphenyl)propan-1-one | Enone, 4g)
Affinity DataIC50: >1.00E+5nMpH: 7.2 T: 2°C. Assay description: IC50 is the concentration of each compound required to inhibit 50% of the binding between the TR LBD and the SRC2-2 peptide using fluorescence polari...
In DepthDetails ArticlePubMed