BDBM18847 (2Z)-3-[(4-hexylphenyl)carbamoyl]prop-2-enoic acid::Substituted Acrylamide, 7b
SMILES CCCCCCc1ccc(NC(=O)\C=C/C(O)=O)cc1
InChI Key InChIKey=OOWYMHDWBQTCOX-QXMHVHEDSA-N
Data  2 IC50
  Tab Delimited (TSV)   2D SDfile   Computed 3D by Vconf -m prep SDfile
Find this compound or compounds like it in BindingDB:
Activity Spreadsheet -- Enzyme Inhibition Constant Data from BindingDB
Found 2 hits for monomerid = 18847
TargetThyroid hormone receptor beta [209-461](Homo sapiens (Human))
St. Jude Research Hospital
LigandPNGBDBM18847((2Z)-3-[(4-hexylphenyl)carbamoyl]prop-2-enoic acid...)
Affinity DataIC50:  1.79E+4nM. Assay description: IC50 is the concentration of each compound required to inhibit 50% of the binding between the TR LBD and the SRC2-2 peptide using fluorescence polari...
In DepthDetails ArticlePubMed
TargetThyroid hormone receptor alpha [148-410](Homo sapiens (Human))
St. Jude Research Hospital
LigandPNGBDBM18847((2Z)-3-[(4-hexylphenyl)carbamoyl]prop-2-enoic acid...)
Affinity DataIC50:  1.75E+4nM. Assay description: IC50 is the concentration of each compound required to inhibit 50% of the binding between the TR LBD and the SRC2-2 peptide using fluorescence polari...
In DepthDetails ArticlePubMed