BDBM189147 US9169270, 19
SMILES Cc1nc2CCN([C@@H](c2s1)c1cc(Cl)ccc1OCC(O)=O)C(=O)OCc1ccccc1
InChI Key InChIKey=SCFZYCGPCUTVMS-OAQYLSRUSA-N
Data  1 IC50
  Tab Delimited (TSV)   2D SDfile   Computed 3D by Vconf -m prep SDfile
Find this compound or compounds like it in BindingDB:
Activity Spreadsheet -- Enzyme Inhibition Constant Data from BindingDB
Found 1 hit for monomerid = 189147
TargetProstaglandin D2 receptor 2(Homo sapiens (Human))
Actelion Pharmaceuticals
US Patent
LigandPNGBDBM189147(US9169270, 19)
Affinity DataIC50:  4.71nMpH: 7.0 T: 2°C. Assay description: Binding assay was performed in a final assay volume of 250 μl. First, 25 μl of test compound, previously diluted in Binding-Buffer (Binding...
In DepthDetails US Patent