BDBM189180 US9169270, 52
SMILES OC(=O)COc1ccc(Cl)cc1C1N(CCc2ncsc12)C(=O)CCN1CCc2ccccc12
InChI Key InChIKey=XTYKNGYBBMYZKH-UHFFFAOYSA-N
Data  1 IC50
  Tab Delimited (TSV)   2D SDfile   Computed 3D by Vconf -m prep SDfile
Find this compound or compounds like it in BindingDB:
Activity Spreadsheet -- Enzyme Inhibition Constant Data from BindingDB
Found 1 hit for monomerid = 189180
TargetProstaglandin D2 receptor 2(Homo sapiens (Human))
Actelion Pharmaceuticals
US Patent
LigandPNGBDBM189180(US9169270, 52)
Affinity DataIC50:  17.7nMpH: 7.0 T: 2°C. Assay description: Binding assay was performed in a final assay volume of 250 μl. First, 25 μl of test compound, previously diluted in Binding-Buffer (Binding...
In DepthDetails US Patent