BDBM189202 US9169270, 74
SMILES OC(=O)COc1ccc(Cl)cc1[C@H]1N(CCc2ncsc12)C(=O)OCCCF
InChI Key InChIKey=LSMAPVLMYPKANV-MRXNPFEDSA-N
Data  1 IC50
  Tab Delimited (TSV)   2D SDfile   Computed 3D by Vconf -m prep SDfile
Find this compound or compounds like it in BindingDB:
Activity Spreadsheet -- Enzyme Inhibition Constant Data from BindingDB
Found 1 hit for monomerid = 189202
TargetProstaglandin D2 receptor 2(Homo sapiens (Human))
Actelion Pharmaceuticals
US Patent
LigandPNGBDBM189202(US9169270, 74)
Affinity DataIC50:  1.40nMpH: 7.0 T: 2°C. Assay description: Binding assay was performed in a final assay volume of 250 μl. First, 25 μl of test compound, previously diluted in Binding-Buffer (Binding...
In DepthDetails US Patent