BDBM189290 US9173869, 71
SMILES COc1cccc(NC(=O)NCc2nc3ccccc3c(=O)n2-c2ccc(F)cc2)c1C
InChI Key InChIKey=MFIMFLFMWNGLTA-UHFFFAOYSA-N
Data  1 IC50
  Tab Delimited (TSV)   2D SDfile   Computed 3D by Vconf -m prep SDfile
Find this compound or compounds like it in BindingDB:
Activity Spreadsheet -- Enzyme Inhibition Constant Data from BindingDB
Found 1 hit for monomerid = 189290
TargetSonic hedgehog protein(Mus musculus (Mouse))
Curis
US Patent
LigandPNGBDBM189290(US9173869, 71)
Affinity DataIC50: <1.00E+4nMT: 2°C. Assay description: Compounds may be tested in the "Gli-Luc" assay below, using the cell line 10T(s12), wherein the cells contain a Hedgehog-responsive reporter construc...
In DepthDetails US Patent