BDBM189453 US9174974, Example 37
SMILES COC[C@H](C)Oc1c(F)cc2NC(=O)OC[C@H](C)c3ccc(cc3C)[C@@H](Nc3ccc4c(N)nccc4c3)C(=O)N(C)Cc1c2
InChI Key InChIKey=WVVWSZKSVKZHGP-FNFPNEPISA-N
Data  2 KI
  Tab Delimited (TSV)   2D SDfile   Computed 3D by Vconf -m prep SDfile
Find this compound or compounds like it in BindingDB:
Activity Spreadsheet -- Enzyme Inhibition Constant Data from BindingDB
Found 2 hits for monomerid = 189453
TargetCoagulation factor VII(Homo sapiens (Human))
Bristol-Myers Squibb
US Patent
LigandPNGBDBM189453(US9174974, Example 37)
Affinity DataKi:  0.140nM. Assay description: FVIIa-Xase Ki (37° C.): S2765 (0.5 mM), PCPS (25 μM), calcium chloride (5 mM), full-length human TF (3 nM), human FVIIa (5 pM), and FVIIa inhibi...
In DepthDetails US Patent
TargetCoagulation factor VII(Homo sapiens (Human))
Bristol-Myers Squibb
US Patent
LigandPNGBDBM189453(US9174974, Example 37)
Affinity DataKi:  190nMpH: 7.4Assay Description:Tissue kallikrein-1 (37° C) activity was determined in reactions containing 0.05 nM enzyme and 90 μM substrate (H-D-Val-Leu-Arg-AFC) in buffer (...
In DepthDetails US Patent