BDBM189720 US10213433, Compound 290::US11369599, Compound 290::US9174982, 290
SMILES CC1CN(CCN1CC1=C(CC(C)(C)CC1)c1ccc(Cl)cc1)c1ccc(C(=O)NS(=O)(=O)c2ccc(NCC3CCOCC3)c(c2)[N+]([O-])=O)c(Oc2cnc3[nH]ccc3c2)c1
InChI Key
Data  3 KI
  Tab Delimited (TSV)   2D SDfile   Computed 3D by Vconf -m prep SDfile
Find this compound or compounds like it in BindingDB:
Activity Spreadsheet -- Enzyme Inhibition Constant Data from BindingDB
Found 3 hits for monomerid = 189720
TargetApoptosis regulator Bcl-2(Homo sapiens (Human))
Abbvie
US Patent
LigandPNGBDBM189720(US10213433, Compound 290 | US11369599, Compound 29...)
Affinity DataKi: <0.0100nM ΔG°: <-15.0kcal/moleT: 2°C. Assay description: Representative compounds were serially diluted in dimethyl sulfoxide (DMSO) starting at 50 uM (2x starting concentration; 10% DMSO) and 10 uL were tr...
In DepthDetails US Patent
TargetApoptosis regulator Bcl-2(Homo sapiens (Human))
Abbvie
US Patent
LigandPNGBDBM189720(US10213433, Compound 290 | US11369599, Compound 29...)
Affinity DataKi: <0.0100nM. Assay description: The inhibition constant (Ki) for binding of representative compounds to Bcl-2 protein, as determined by a TR-FRET (Time-Resolved Fluorescence-Resonan...
In DepthDetails US Patent
TargetApoptosis regulator Bcl-2(Homo sapiens (Human))
Abbvie
US Patent
LigandPNGBDBM189720(US10213433, Compound 290 | US11369599, Compound 29...)
Affinity DataKi: <0.0100nM. Assay description: TR-FRET (Time-Resolved Fluorescence-Resonance-Energy-Transfer) assay.
In DepthDetails US Patent