BDBM18973 1-(3-chlorophenyl)-3-methyl-N-[4-(2-sulfamoylphenyl)phenyl]-1H-pyrazole-5-carboxamide::pyrazole-based inhibitor, 22c
SMILES Cc1cc(C(=O)Nc2ccc(cc2)-c2ccccc2S(N)(=O)=O)n(n1)-c1cccc(Cl)c1
InChI Key InChIKey=DMYOKOORJXDYLZ-UHFFFAOYSA-N
Data  1 KI
  Tab Delimited (TSV)   2D SDfile   Computed 3D by Vconf -m prep SDfile
Find this compound or compounds like it in BindingDB:
Activity Spreadsheet -- Enzyme Inhibition Constant Data from BindingDB
Found 1 hit for monomerid = 18973
TargetCoagulation factor X(Homo sapiens (Human))
Bristol-Myers Squibb
LigandPNGBDBM18973(1-(3-chlorophenyl)-3-methyl-N-[4-(2-sulfamoylpheny...)
Affinity DataKi:  37nM ΔG°:  -10.0kcal/molepH: 7.0 T: 2°C. Assay description: Ki values were obtained from purified enzyme. All assays were run in microtiter plates. Plates were read for 30 min at 405 nm. Rates were determined ...
In DepthDetails ArticlePubMed