BDBM189908 US9174997, 128
SMILES CCS(=O)(=O)c1cc(ccc1[C@H]1N(C)C(=O)N(C(C)=C1[N+]#[C-])c1cccc(c1)C(F)(F)F)C#N
InChI Key InChIKey=PZUNVECERKOBRI-OAQYLSRUSA-N
Data  1 IC50
  Tab Delimited (TSV)   2D SDfile   Computed 3D by Vconf -m prep SDfile
Find this compound or compounds like it in BindingDB:
Activity Spreadsheet -- Enzyme Inhibition Constant Data from BindingDB
Found 1 hit for monomerid = 189908
TargetNeutrophil elastase(Homo sapiens (Human))
Bayer Intellectual Property
US Patent
LigandPNGBDBM189908(US9174997, 128)
Affinity DataIC50: <0.300nMpH: 7.4 T: 2°C. Assay description: The potency of the compounds of the invention is ascertained in an in vitro inhibition assay. The HNE-mediated amidolytic cleavage of a suitable pept...
In DepthDetails US Patent