BDBM18998 6-[4-(2-{[(3R)-3-hydroxypyrrolidin-1-yl]methyl}phenyl)phenyl]-1-(4-methoxyphenyl)-3-(methylamino)-1H,4H,5H,6H,7H-pyrazolo[3,4-c]pyridin-7-one::Pyrazolopyridinone analogue, 24
SMILES CNc1nn(c2c1CCN(C2=O)c1ccc(cc1)-c1ccccc1CN1CC[C@@H](O)C1)-c1ccc(OC)cc1
InChI Key InChIKey=CFMAGVSIRHKWHW-RUZDIDTESA-N
Data  2 KI
  Tab Delimited (TSV)   2D SDfile   Computed 3D by Vconf -m prep SDfile
Find this compound or compounds like it in BindingDB:
Activity Spreadsheet -- Enzyme Inhibition Constant Data from BindingDB
Found 2 hits for monomerid = 18998
TargetCoagulation factor X(Homo sapiens (Human))
Bristol-Myers Squibb
LigandPNGBDBM18998(6-[4-(2-{[(3R)-3-hydroxypyrrolidin-1-yl]methyl}phe...)
Affinity DataKi:  1.70nM ΔG°:  -11.8kcal/molepH: 7.0 T: 2°C. Assay description: Ki values were obtained from human purified enzyme. All assays were run in microtiter plates. Plates were read for 30 min at 405 nm. Rates were deter...
In DepthDetails ArticlePubMed
TargetProthrombin(Homo sapiens (Human))
Bristol-Myers Squibb
LigandPNGBDBM18998(6-[4-(2-{[(3R)-3-hydroxypyrrolidin-1-yl]methyl}phe...)
Affinity DataKi:  4.80E+3nM. Assay description: Ki values were obtained from human purified enzyme. All assays were run in microtiter plates. Plates were read for 30 min at 405 nm. Rates were deter...
In DepthDetails ArticlePubMed