BDBM19005 6-[4-(2-{[(3R)-3-hydroxypyrrolidin-1-yl]methyl}phenyl)phenyl]-1-(4-methoxyphenyl)-3-(1H-1,2,3,4-tetrazol-1-ylmethyl)-1H,4H,5H,6H,7H-pyrazolo[3,4-c]pyridin-7-one::Pyrazolopyridinone analogue, 33d
SMILES COc1ccc(cc1)-n1nc(Cn2cnnn2)c2CCN(C(=O)c12)c1ccc(cc1)-c1ccccc1CN1CC[C@@H](O)C1
InChI Key InChIKey=XSEZTBVLOUTJTF-AREMUKBSSA-N
Data  2 KI
  Tab Delimited (TSV)   2D SDfile   Computed 3D by Vconf -m prep SDfile
Find this compound or compounds like it in BindingDB:
Activity Spreadsheet -- Enzyme Inhibition Constant Data from BindingDB
Found 2 hits for monomerid = 19005
TargetCoagulation factor X(Homo sapiens (Human))
Bristol-Myers Squibb
LigandPNGBDBM19005(6-[4-(2-{[(3R)-3-hydroxypyrrolidin-1-yl]methyl}phe...)
Affinity DataKi:  0.850nM ΔG°:  -12.2kcal/molepH: 7.0 T: 2°C. Assay description: Ki values were obtained from human purified enzyme. All assays were run in microtiter plates. Plates were read for 30 min at 405 nm. Rates were deter...
In DepthDetails ArticlePubMed
TargetProthrombin(Homo sapiens (Human))
Bristol-Myers Squibb
LigandPNGBDBM19005(6-[4-(2-{[(3R)-3-hydroxypyrrolidin-1-yl]methyl}phe...)
Affinity DataKi:  970nM. Assay description: Ki values were obtained from human purified enzyme. All assays were run in microtiter plates. Plates were read for 30 min at 405 nm. Rates were deter...
In DepthDetails ArticlePubMed