BDBM190232 US10227346, Example 60::US10426135, Example 60::US9670201, 60 (R)-3-cyano-N-(3-(1-(cyclopentanecarbonyl)-2,2-dimethylpiperidin-4-yl)-1,4-dimethyl-1H-pyrrolo[2,3-b]pyridin-5-yl)-4-methoxybenzamide::US9920054, Example 60
SMILES COc1ccc(cc1C#N)C(=O)Nc1cnc2n(C)cc([C@@H]3CCN(C(=O)C4CCCC4)C(C)(C)C3)c2c1C
InChI Key InChIKey=ACUIDWGXWZDBJZ-JOCHJYFZSA-N
Data  4 IC50
  Tab Delimited (TSV)   2D SDfile   Computed 3D by Vconf -m prep SDfile
Find this compound or compounds like it in BindingDB:
Activity Spreadsheet -- Enzyme Inhibition Constant Data from BindingDB
Found 4 hits for monomerid = 190232
TargetNuclear receptor ROR-gamma(Homo sapiens (Human))
Pfizer
US Patent
LigandPNGBDBM190232(US10227346, Example 60 | US10426135, Example 60 | ...)
Affinity DataIC50:  15nMpH: 7.5 T: 2°C. Assay description: Specifically, in one embodiment the aforementioned assay was performed as outlined below. The assay was carried out in black polystyrene, 384-well pl...
Ligand InfoPC cidPC sid
In DepthDetails US Patent
TargetNuclear receptor ROR-gamma(Homo sapiens (Human))
Pfizer
US Patent
LigandPNGBDBM190232(US10227346, Example 60 | US10426135, Example 60 | ...)
Affinity DataIC50:  15.4nM. Assay description: The activity of compound of the invention can be determined by a co-activator recruitment by TR-FRET (time-resolved fluorescence resonance energy tra...
Ligand InfoPC cidPC sid
In DepthDetails US Patent
TargetNuclear receptor ROR-gamma(Homo sapiens (Human))
Pfizer
US Patent
LigandPNGBDBM190232(US10227346, Example 60 | US10426135, Example 60 | ...)
Affinity DataIC50:  15.4nM
Ligand InfoPC cidPC sid
In DepthDetails US Patent
TargetNuclear receptor ROR-gamma(Homo sapiens (Human))
Pfizer
US Patent
LigandPNGBDBM190232(US10227346, Example 60 | US10426135, Example 60 | ...)
Affinity DataIC50:  15.4nM. Assay description: The activity of compound of the invention can be determined by a co-activator recruitment by TR-FRET (time-resolved fluorescence resonance energy tra...
Ligand InfoPC cidPC sid
In DepthDetails US Patent