BDBM190477 US9181181, 15::US9181181, 19
SMILES Cc1oc(nc1CC(=O)OCc1ccc(CC(SCCc2ccc(F)cc2)C(O)=O)cc1)-c1ccccc1
InChI Key InChIKey=UEUVSLJEUDTYNY-UHFFFAOYSA-N
Data  4 EC50
  Tab Delimited (TSV)   2D SDfile   Computed 3D by Vconf -m prep SDfile
Find this compound or compounds like it in BindingDB:
Activity Spreadsheet -- Enzyme Inhibition Constant Data from BindingDB
Found 4 hits for monomerid = 190477
TargetPeroxisome proliferator-activated receptor alpha [169-468](Homo sapiens (Human))
Albireo
US Patent
LigandPNGBDBM190477(US9181181, 15 | US9181181, 19)
Affinity DataEC50:  130nM. Assay description: Transactivation Assay Expression vectors were prepared by inserting the ligand binding domain cDNA (complementary DNA) of human PPARalpha (amino acid...
In DepthDetails US Patent
TargetPeroxisome proliferator-activated receptor gamma [205-505](Homo sapiens (Human))
Albireo
US Patent
LigandPNGBDBM190477(US9181181, 15 | US9181181, 19)
Affinity DataEC50:  470nM. Assay description: Transactivation Assay Expression vectors were prepared by inserting the ligand binding domain cDNA (complementary DNA) of human PPARalpha (amino acid...
In DepthDetails US Patent
TargetPeroxisome proliferator-activated receptor gamma [205-505](Homo sapiens (Human))
Albireo
US Patent
LigandPNGBDBM190477(US9181181, 15 | US9181181, 19)
Affinity DataEC50:  840nM. Assay description: Transactivation Assay Expression vectors were prepared by inserting the ligand binding domain cDNA (complementary DNA) of human PPARalpha (amino acid...
In DepthDetails US Patent
TargetPeroxisome proliferator-activated receptor alpha [169-468](Homo sapiens (Human))
Albireo
US Patent
LigandPNGBDBM190477(US9181181, 15 | US9181181, 19)
Affinity DataEC50:  72nM. Assay description: Transactivation Assay Expression vectors were prepared by inserting the ligand binding domain cDNA (complementary DNA) of human PPARalpha (amino acid...
In DepthDetails US Patent